Target
Receptor-interacting serine/threonine-protein kinase 1
Ligand
BDBM470281
Substrate
Meas. Tech.
Biochemical Assay
IC50
79.4±n/a nM
Citation
 Masuda, EShaw, STaylor, VBhamidipati, S RIP1 inhibitory compounds and methods for making and using the same US Patent  US10815206 Publication Date 10/27/2020 
Target
Name:
Receptor-interacting serine/threonine-protein kinase 1
Synonyms:
Cell death protein RIP RIP-1 RIPK1 Receptor-interacting protein 1
Type:
Enzyme Catalytic Domain
Mol. Mass.:
75926.99
Organism:
Homo sapiens (Human)
Description:
Q13546
Residue:
671
  
Inhibitor
Name:
BDBM470281
Synonyms:
US10815206, Compound I-66
Type:
Small organic molecule
Emp. Form.:
C27H23Cl2F3N9O3
Mol. Mass.:
649.431
SMILES:
CN1c2ccc(CN3CCn4nc(nc4C3)C(F)(F)F)cc2OC[C@H](NC(=O)c2nnc(Cc3c(Cl)cccc3Cl)n2)C1=O
: