Target
Receptor-interacting serine/threonine-protein kinase 1
Ligand
BDBM470289
Substrate
Meas. Tech.
Biochemical Assay
IC50
21.7±n/a nM
Citation
 Masuda, EShaw, STaylor, VBhamidipati, S RIP1 inhibitory compounds and methods for making and using the same US Patent  US10815206 Publication Date 10/27/2020 
Target
Name:
Receptor-interacting serine/threonine-protein kinase 1
Synonyms:
Cell death protein RIP RIP-1 RIPK1 Receptor-interacting protein 1
Type:
Enzyme Catalytic Domain
Mol. Mass.:
75926.99
Organism:
Homo sapiens (Human)
Description:
Q13546
Residue:
671
  
Inhibitor
Name:
BDBM470289
Synonyms:
US10815206, Compound I-71 US11370764, Compound I-71 | US11377428, Compound I-71
Type:
Small organic molecule
Emp. Form.:
C25H24N4O5
Mol. Mass.:
460.4819
SMILES:
CN1c2cc(ccc2OC[C@H](NC(=O)c2nnc(Cc3ccccc3)o2)C1=O)C#CC(C)(C)O
: