Target
Tyrosine-protein kinase BTK
Ligand
BDBM377756
Substrate
Meas. Tech.
LanthaScreen Assay
IC50
1.80±n/a nM
Citation
 Springer, JRDevadas, BGarland, DJGrapperhaus, MLHan, SHockerman, SLHughes, ROSaiah, ESchnute, MESelness, SRWalker, DPWan, ZXing, LZapf, CWSchmidt, MA Bruton's tyrosine kinase inhibitors US Patent  US10815213 Publication Date 10/27/2020 
Target
Name:
Tyrosine-protein kinase BTK
Synonyms:
AGMX1 Agammaglobulinaemia tyrosine kinase B cell progenitor kinase BPK BTK_HUMAN Tyrosine Kinase BTK Tyrosine-protein kinase BTK (BTK)
Type:
Enzyme
Mol. Mass.:
76289.95
Organism:
Homo sapiens (Human)
Description:
Q06187
Residue:
659
  
Inhibitor
Name:
BDBM377756
Synonyms:
5-amino-1-(1-cyanopiperidin-3-yl)- 3-[4-(2,4- dichlorophenoxy)phenyl]-1H- pyrazole-4-carboxamide US10815213, Example 50
Type:
Small organic molecule
Emp. Form.:
C22H20Cl2N6O2
Mol. Mass.:
471.339
SMILES:
NC(=O)c1c(N)n(nc1-c1ccc(Oc2ccc(Cl)cc2Cl)cc1)C1CCCN(C1)C#N
: