Target
Tyrosine-protein kinase BTK
Ligand
BDBM377771
Substrate
Meas. Tech.
LanthaScreen Assay
IC50
10.6±n/a nM
Citation
 Springer, JRDevadas, BGarland, DJGrapperhaus, MLHan, SHockerman, SLHughes, ROSaiah, ESchnute, MESelness, SRWalker, DPWan, ZXing, LZapf, CWSchmidt, MA Bruton's tyrosine kinase inhibitors US Patent  US10815213 Publication Date 10/27/2020 
Target
Name:
Tyrosine-protein kinase BTK
Synonyms:
AGMX1 Agammaglobulinaemia tyrosine kinase B cell progenitor kinase BPK BTK_HUMAN Tyrosine Kinase BTK Tyrosine-protein kinase BTK (BTK)
Type:
Enzyme
Mol. Mass.:
76289.95
Organism:
Homo sapiens (Human)
Description:
Q06187
Residue:
659
  
Inhibitor
Name:
BDBM377771
Synonyms:
5-amino-1-(1-cyanopiperidin-3-yl)- 3-[4-(2-methoxyphenoxy)phenyl]- 1H-pyrazole-4-carboxamide US10815213, Example 65
Type:
Small organic molecule
Emp. Form.:
C23H24N6O3
Mol. Mass.:
432.4751
SMILES:
COc1ccccc1Oc1ccc(cc1)-c1nn(C2CCCN(C2)C#N)c(N)c1C(N)=O
: