Target
Tyrosine-protein kinase BTK
Ligand
BDBM470490
Substrate
Meas. Tech.
LanthaScreen Assay
IC50
1.50±n/a nM
Citation
 Springer, JRDevadas, BGarland, DJGrapperhaus, MLHan, SHockerman, SLHughes, ROSaiah, ESchnute, MESelness, SRWalker, DPWan, ZXing, LZapf, CWSchmidt, MA Bruton's tyrosine kinase inhibitors US Patent  US10815213 Publication Date 10/27/2020 
Target
Name:
Tyrosine-protein kinase BTK
Synonyms:
AGMX1 Agammaglobulinaemia tyrosine kinase B cell progenitor kinase BPK BTK_HUMAN Tyrosine Kinase BTK Tyrosine-protein kinase BTK (BTK)
Type:
Enzyme
Mol. Mass.:
76289.95
Organism:
Homo sapiens (Human)
Description:
Q06187
Residue:
659
  
Inhibitor
Name:
BDBM470490
Synonyms:
5-amino-1-{(3R)-1-[(2E)-3-cyanoprop-2-enoyl]piperidin-3-yl}-3-[4-(2,4-difluorophenoxy)phenyl]-1H-pyrazole-4-carboxamide | US10815213, Example 152
Type:
Small organic molecule
Emp. Form.:
C25H22F2N6O3
Mol. Mass.:
492.4774
SMILES:
NC(=O)c1c(N)n(nc1-c1ccc(Oc2ccc(F)cc2F)cc1)[C@@H]1CCCN(C1)C(=O)\C=C\C#N
: