Target
Dihydroorotate dehydrogenase (quinone), mitochondrial
Ligand
BDBM470407
Substrate
Meas. Tech.
Enzymatic Assay
IC50
5.00±n/a nM
Citation
 Gradl, SNNguyen, DEis, KGünther, JStellfeld, TJanzer, AChristian, SMüller, TSheikh, SEZhou, HJZhao, CSykes, DBFerrara, SJLiu, KKröber, MMerz, CNiehues, MSchäfer, MZimmermann, KNising, CF 2,4,5-trisubstituted 1,2,4-triazolones useful as inhibitors of DHODH US Patent  US10815215 Publication Date 10/27/2020 
Target
Name:
Dihydroorotate dehydrogenase (quinone), mitochondrial
Synonyms:
DHODH Dihydroorotate dehydrogenase Dihydroorotate dehydrogenase, mitochondrial Dihydroorotate oxidase (DHODH) | PYRD_HUMAN
Type:
Enzyme
Mol. Mass.:
42881.33
Organism:
Homo sapiens (Human)
Description:
Q02127
Residue:
395
  
Inhibitor
Name:
BDBM470407
Synonyms:
5-fluoro-N-(2-fluoro-6-methylphenyl)-4-[4-methyl-5-oxo-3-(propan-2-yl)-4,5-dihydro-1H-1,2,4-triazol-1-yl]-2-{[(2S)-1,1,1-trifluoropropan-2-yl]oxy}benzamide US11130745, Example 66 | US11713304, Example 66
Type:
Small organic molecule
Emp. Form.:
C23H23F5N4O3
Mol. Mass.:
498.4457
SMILES:
CC(C)c1nn(-c2cc(O[C@@H](C)C(F)(F)F)c(cc2F)C(=O)Nc2c(C)cccc2F)c(=O)n1C
: