Target
Dihydroorotate dehydrogenase (quinone), mitochondrial
Ligand
BDBM470480
Substrate
Meas. Tech.
Enzymatic Assay
IC50
4.50±n/a nM
Citation
 Gradl, SNNguyen, DEis, KGünther, JStellfeld, TJanzer, AChristian, SMüller, TSheikh, SEZhou, HJZhao, CSykes, DBFerrara, SJLiu, KKröber, MMerz, CNiehues, MSchäfer, MZimmermann, KNising, CF 2,4,5-trisubstituted 1,2,4-triazolones useful as inhibitors of DHODH US Patent  US10815215 Publication Date 10/27/2020 
Target
Name:
Dihydroorotate dehydrogenase (quinone), mitochondrial
Synonyms:
DHODH Dihydroorotate dehydrogenase Dihydroorotate dehydrogenase, mitochondrial Dihydroorotate oxidase (DHODH) | PYRD_HUMAN
Type:
Enzyme
Mol. Mass.:
42881.33
Organism:
Homo sapiens (Human)
Description:
Q02127
Residue:
395
  
Inhibitor
Name:
BDBM470480
Synonyms:
5-fluoro-N-(2-fluoro-6-methylphenyl)-4-[3-(2-hydroxypropan-2-yl)-4-methyl-5-oxo-4,5-dihydro-1H-1,2,4-triazol-1-yl]-2-[(2S)-pentan-2-yloxy]benzamide US11130745, Example 143 | US11713304, Example 143
Type:
Small organic molecule
Emp. Form.:
C25H30F2N4O4
Mol. Mass.:
488.5269
SMILES:
CCC[C@H](C)Oc1cc(c(F)cc1C(=O)Nc1c(C)cccc1F)-n1nc(n(C)c1=O)C(C)(C)O
: