Target
Sodium channel protein type 8 subunit alpha
Ligand
BDBM373764
Substrate
Meas. Tech.
Electrophysiological Assay
IC50
29.0±n/a nM
Citation
 Burford, KNChowdhury, SDehnhardt, CMFocken, TGrimwood, MEHasan, SA Benzenesulfonamide compounds and their use as therapeutic agents US Patent  US10815229 Publication Date 10/27/2020 
Target
Name:
Sodium channel protein type 8 subunit alpha
Synonyms:
MED SCN8A_HUMAN Sodium channel protein type 8 subunit alpha Voltage-gated sodium channel subunit alpha Nav1.6 | ep nav1.6
Type:
PROTEIN
Mol. Mass.:
225271.59
Organism:
Homo sapiens (Human)
Description:
ChEMBL_1516902
Residue:
1980
  
Inhibitor
Name:
BDBM373764
Synonyms:
(S)-3-chloro-4-((1-(3-(difluoromethyl)benzyl)pyrrolidin-3-yl)(methyl)amino)-N-(1,2,4-thiadiazol-5-yl)benzenesulfonamide US10662184, Example 31 US11299490, Example 31
Type:
Small organic molecule
Emp. Form.:
C21H22ClF2N5O2S2
Mol. Mass.:
514.011
SMILES:
CN([C@H]1CCN(Cc2cccc(c2)C(F)F)C1)c1ccc(cc1Cl)S(=O)(=O)Nc1ncns1
: