Target
Sodium channel protein type 8 subunit alpha
Ligand
BDBM373765
Substrate
Meas. Tech.
In Vitro Assay
IC50
47.0±n/a nM
Citation
 Burford, KNChowdhury, SDehnhardt, CMFocken, TGrimwood, MEHasan, SA Benzenesulfonamide compounds and their use as therapeutic agents US Patent  US10815229 Publication Date 10/27/2020 
Target
Name:
Sodium channel protein type 8 subunit alpha
Synonyms:
MED SCN8A_HUMAN Sodium channel protein type 8 subunit alpha Voltage-gated sodium channel subunit alpha Nav1.6 | ep nav1.6
Type:
PROTEIN
Mol. Mass.:
225271.59
Organism:
Homo sapiens (Human)
Description:
ChEMBL_1516902
Residue:
1980
  
Inhibitor
Name:
BDBM373765
Synonyms:
(S)-3-chloro-4-((1-(3-chloro-2-fluorobenzyl)pyrrolidin-3-yl)(methyl)amino)-N-(1,2,4-thiadiazol-5-yl)benzenesulfonamide US10815229, Example 32
Type:
Small organic molecule
Emp. Form.:
C20H20Cl2FN5O2S2
Mol. Mass.:
516.44
SMILES:
CN([C@H]1CCN(Cc2cccc(Cl)c2F)C1)c1ccc(cc1Cl)S(=O)(=O)Nc1ncns1
: