Target
Sodium channel protein type 8 subunit alpha
Ligand
BDBM373840
Substrate
Meas. Tech.
In Vitro Assay
IC50
49.0±n/a nM
Citation
 Burford, KNChowdhury, SDehnhardt, CMFocken, TGrimwood, MEHasan, SA Benzenesulfonamide compounds and their use as therapeutic agents US Patent  US10815229 Publication Date 10/27/2020 
Target
Name:
Sodium channel protein type 8 subunit alpha
Synonyms:
MED SCN8A_HUMAN Sodium channel protein type 8 subunit alpha Voltage-gated sodium channel subunit alpha Nav1.6 | ep nav1.6
Type:
PROTEIN
Mol. Mass.:
225271.59
Organism:
Homo sapiens (Human)
Description:
ChEMBL_1516902
Residue:
1980
  
Inhibitor
Name:
BDBM373840
Synonyms:
(S)-2-fluoro-4-((1-((2-isopropylthiazol-4-yl)methyl)pyrrolidin-3-yl)(methyl)amino)-5-methyl-N-(thiazol-4-yl)benzenesulfonamide 2,2,2-trifluoroacetate US10815229, Example 107
Type:
Small organic molecule
Emp. Form.:
C22H28FN5O2S3
Mol. Mass.:
509.683
SMILES:
CC(C)c1nc(CN2CC[C@@H](C2)N(C)c2cc(F)c(cc2C)S(=O)(=O)Nc2cscn2)cs1
: