Target
Sodium channel protein type 8 subunit alpha
Ligand
BDBM373851
Substrate
Meas. Tech.
In Vitro Assay
IC50
58.0±n/a nM
Citation
 Burford, KNChowdhury, SDehnhardt, CMFocken, TGrimwood, MEHasan, SA Benzenesulfonamide compounds and their use as therapeutic agents US Patent  US10815229 Publication Date 10/27/2020 
Target
Name:
Sodium channel protein type 8 subunit alpha
Synonyms:
MED SCN8A_HUMAN Sodium channel protein type 8 subunit alpha Voltage-gated sodium channel subunit alpha Nav1.6 | ep nav1.6
Type:
PROTEIN
Mol. Mass.:
225271.59
Organism:
Homo sapiens (Human)
Description:
ChEMBL_1516902
Residue:
1980
  
Inhibitor
Name:
BDBM373851
Synonyms:
(S)-2-fluoro-5-methyl-4-(methyl(1-((1-(2,2,2-trifluoroethyl)-1H-pyrazol-3-yl)methyl)pyrrolidin-3-yl)amino)-N-(thiazol-4-yl)benzenesulfonamide US10815229, Example 118
Type:
Small organic molecule
Emp. Form.:
C21H24F4N6O2S2
Mol. Mass.:
532.578
SMILES:
CN([C@H]1CCN(Cc2ccn(CC(F)(F)F)n2)C1)c1cc(F)c(cc1C)S(=O)(=O)Nc1cscn1
: