Target
Sodium channel protein type 8 subunit alpha
Ligand
BDBM374010
Substrate
Meas. Tech.
Electrophysiological Assay
IC50
27.0±n/a nM
Citation
 Burford, KNChowdhury, SDehnhardt, CMFocken, TGrimwood, MEHasan, SA Benzenesulfonamide compounds and their use as therapeutic agents US Patent  US10815229 Publication Date 10/27/2020 
Target
Name:
Sodium channel protein type 8 subunit alpha
Synonyms:
MED SCN8A_HUMAN Sodium channel protein type 8 subunit alpha Voltage-gated sodium channel subunit alpha Nav1.6 | ep nav1.6
Type:
PROTEIN
Mol. Mass.:
225271.59
Organism:
Homo sapiens (Human)
Description:
ChEMBL_1516902
Residue:
1980
  
Inhibitor
Name:
BDBM374010
Synonyms:
(S)-4-((1-benzylpyrrolidin-3-yl)(methyl)amino)-2-fluoro-N-(isothiazol-3-yl)-5-methylbenzenesulfonamide 2,2,2-trifluoroacetate US10662184, Example 277 US11299490, Example 277
Type:
Small organic molecule
Emp. Form.:
C22H25FN4O2S2
Mol. Mass.:
460.588
SMILES:
CN([C@H]1CCN(Cc2ccccc2)C1)c1cc(F)c(cc1C)S(=O)(=O)Nc1ccsn1
: