Target
Sodium channel protein type 8 subunit alpha
Ligand
BDBM374016
Substrate
Meas. Tech.
Electrophysiological Assay
IC50
37.0±n/a nM
Citation
 Burford, KNChowdhury, SDehnhardt, CMFocken, TGrimwood, MEHasan, SA Benzenesulfonamide compounds and their use as therapeutic agents US Patent  US10815229 Publication Date 10/27/2020 
Target
Name:
Sodium channel protein type 8 subunit alpha
Synonyms:
MED SCN8A_HUMAN Sodium channel protein type 8 subunit alpha Voltage-gated sodium channel subunit alpha Nav1.6 | ep nav1.6
Type:
PROTEIN
Mol. Mass.:
225271.59
Organism:
Homo sapiens (Human)
Description:
ChEMBL_1516902
Residue:
1980
  
Inhibitor
Name:
BDBM374016
Synonyms:
(R)-2,6-difluoro-3-methyl-4-((1-(1-phenylethyl)piperidin-4-yl)oxy)-N-(thiazol-4-yl)benzenesulfonamide trifluoroacetic formate US10662184, Example 283 US11299490, Example 283
Type:
Small organic molecule
Emp. Form.:
C22H22ClF2N3O3S2
Mol. Mass.:
514.008
SMILES:
C[C@@H](N1CCC(CC1)Oc1cc(F)c(c(F)c1Cl)S(=O)(=O)Nc1cscn1)c1ccccc1
: