Target
Menin
Ligand
BDBM470583
Substrate
Meas. Tech.
Test for Evaluating the Inhibition of the Menin-MLL Binding
IC50
7.90±n/a nM
Citation
 Kamioka, SBan, HShimada, NHirose, WArakawa, AYamazaki, KHira, K Optically active azabicyclo ring derivative US Patent  US10815241 Publication Date 10/27/2020 
Target
Name:
Menin
Synonyms:
MEN1 Menin/Histone-lysine N-methyltransferase MLL | SCG2
Type:
Protein
Mol. Mass.:
68022.55
Organism:
Homo sapiens (Human)
Description:
O00255
Residue:
615
  
Inhibitor
Name:
BDBM470583
Synonyms:
US10815241, Example 8 | US11369605, Example 8
Type:
Small organic molecule
Emp. Form.:
C33H43FN6O3
Mol. Mass.:
590.7313
SMILES:
CC(C)N(C(C)C)C(=O)c1cc(F)ccc1Oc1cncnc1N1CC2(C1)CCN(CC2)C(=O)[C@H]1N[C@H]2CC[C@@H]1CC2=C
: