Target
Menin
Ligand
BDBM470586
Substrate
Meas. Tech.
Test for Evaluating the Inhibition of the Menin-MLL Binding
IC50
7.00±n/a nM
Citation
 Kamioka, SBan, HShimada, NHirose, WArakawa, AYamazaki, KHira, K Optically active azabicyclo ring derivative US Patent  US10815241 Publication Date 10/27/2020 
Target
Name:
Menin
Synonyms:
MEN1 Menin/Histone-lysine N-methyltransferase MLL | SCG2
Type:
Protein
Mol. Mass.:
68022.55
Organism:
Homo sapiens (Human)
Description:
O00255
Residue:
615
  
Inhibitor
Name:
BDBM470586
Synonyms:
US10815241, Example 11 | US11369605, Example 11
Type:
Small organic molecule
Emp. Form.:
C30H39FN6O3
Mol. Mass.:
550.6675
SMILES:
CC(C)N(C(C)C)C(=O)c1cc(F)ccc1Oc1cncnc1N1CC2(CN(C2)C(=O)C2NC3CCC2CC3)C1
: