Target
Induced myeloid leukemia cell differentiation protein Mcl-1 [171-327]
Ligand
BDBM470893
Substrate
Meas. Tech.
Time-Resolved Fluorescence Resonance Energy Transfer (TR-FRET) Assay
IC50
0.039±n/a nM
Citation
 Harrington, PEAshton, KBrown, SPKaller, MRKohn, TJLanman, BALi, KLi, YLow, JDMinatti, AEPickrell, AJStec, MMTaygerly, J Compounds that inhibit Mcl-1 protein US Patent  US10821115 Publication Date 11/3/2020 
Target
Name:
Induced myeloid leukemia cell differentiation protein Mcl-1 [171-327]
Synonyms:
BCL2L3 MCL1 Myeloid cell leukemia 1 (Mcl-1)
Type:
Enzyme Catalytic Domain
Mol. Mass.:
17896.13
Organism:
Homo sapiens (Human)
Description:
Q07820[171-327]
Residue:
157
  
Inhibitor
Name:
BDBM470893
Synonyms:
(3R)-3-(4- (((1S,3'R,6'R,7'S,8'E,11'S, 12'R)-6-chloro-7'-methoxy- 11',12'-dimethyl-13',13'- dioxido-15'-oxo-3,4-dihydro- 2H-spiro[naphthalene-1,22'- [20]oxa[13]thia[1,14] diazatetracyclo [14.7.2.0~3,6~.0~19,24~] pentacosa[8,16,18,24]tetraen]- 7'-yl)methyl)-1-piperazinyl)-5- hydroxypentanoic acid US11224601, Example 278
Type:
Small organic molecule
Emp. Form.:
C43H59ClN4O8S
Mol. Mass.:
827.469
SMILES:
CO[C@@]1(CN2CCN(CC2)[C@H](CCO)CC(O)=O)\C=C\C[C@H](C)[C@@H](C)S(=O)(=O)NC(=O)c2ccc3OC[C@]4(CCCc5cc(Cl)ccc45)CN(C[C@@H]4CC[C@@H]14)c3c2
: