Target
Induced myeloid leukemia cell differentiation protein Mcl-1 [171-327]
Ligand
BDBM470988
Substrate
Meas. Tech.
Time-Resolved Fluorescence Resonance Energy Transfer (TR-FRET) Assay
IC50
0.055±n/a nM
Citation
 Harrington, PEAshton, KBrown, SPKaller, MRKohn, TJLanman, BALi, KLi, YLow, JDMinatti, AEPickrell, AJStec, MMTaygerly, J Compounds that inhibit Mcl-1 protein US Patent  US10821115 Publication Date 11/3/2020 
Target
Name:
Induced myeloid leukemia cell differentiation protein Mcl-1 [171-327]
Synonyms:
BCL2L3 MCL1 Myeloid cell leukemia 1 (Mcl-1)
Type:
Enzyme Catalytic Domain
Mol. Mass.:
17896.13
Organism:
Homo sapiens (Human)
Description:
Q07820[171-327]
Residue:
157
  
Inhibitor
Name:
BDBM470988
Synonyms:
US10821115, Example 100001 US11224601, Example 100261
Type:
Small organic molecule
Emp. Form.:
C37H47ClN2O5S3
Mol. Mass.:
731.427
SMILES:
CO[C@]1(\C=C\C[C@H](C)[C@@H](C)S(=O)(=O)NC(=O)c2ccc3OC[C@]4(CCCc5cc(Cl)ccc45)CN(C[C@@H]4CC[C@@H]14)c3c2)C1SCCCS1
: