Target
Receptor tyrosine-protein kinase erbB-2
Ligand
BDBM471590
Substrate
Meas. Tech.
Inhibition Assay
IC50
6.17±n/a nM
Citation
 Li, ZZhong, WWang, JZeng, QTsui, HYang, ZZhang, X ErbB receptor inhibitors US Patent  US10822334 Publication Date 11/3/2020 
Target
Name:
Receptor tyrosine-protein kinase erbB-2
Synonyms:
2.7.10.1 CD_antigen=CD340 ERBB2_HUMAN FASN/HER2 HER2 MLN19 NEU Proto-oncogene Neu Tyrosine kinase-type cell surface receptor HER2 | p185erbB2
Type:
Mol. Mass.:
137894.47
Organism:
Homo sapiens (Human)
Description:
P04626
Residue:
1255
  
Inhibitor
Name:
BDBM471590
Synonyms:
US10822334, Compound 2
Type:
Small organic molecule
Emp. Form.:
C30H29F2N7O2
Mol. Mass.:
557.5938
SMILES:
Cc1cc(Nc2ncnc3cccc(O[C@@H]4C[C@@H]5CC[C@H](C4)N5CC(F)F)c23)ccc1Oc1ccn2ncnc2c1
: