Target
Adenosine receptor A2a
Ligand
BDBM471641
Substrate
Meas. Tech.
Competition Binding Assay
Ki
0.500±n/a nM
Citation
 Ali, AHuang, XLim, YKuang, RWu, HAnand, RYu, YMetzger, EMan-Chu Lo, MTing, PCStamford, AWTempest, P Substituted aminoquinazoline compounds as A2A antagonist US Patent  US10822338 Publication Date 11/3/2020 
Target
Name:
Adenosine receptor A2a
Synonyms:
A2A adenosine receptor (hA2A) ADENOSINE A2 ADORA2 Adenosine A2A receptor (A2AAR)
Type:
G Protein-Coupled Receptor (GPCR)
Mol. Mass.:
44716.46
Organism:
Homo sapiens (Human)
Description:
P29274
Residue:
412
  
Inhibitor
Name:
BDBM471641
Synonyms:
US10822338, Example 24A
Type:
Small organic molecule
Emp. Form.:
C21H25F3N6O
Mol. Mass.:
434.458
SMILES:
COc1cccc2c3nc(nn3c(N)nc12)[C@@H]1CCCN(C[C@@H](C2CC2)C(F)(F)F)C1
: