Target
Adenosine receptor A2a
Ligand
BDBM471649
Substrate
Meas. Tech.
Competition Binding Assay
Ki
0.400±n/a nM
Citation
 Ali, AHuang, XLim, YKuang, RWu, HAnand, RYu, YMetzger, EMan-Chu Lo, MTing, PCStamford, AWTempest, P Substituted aminoquinazoline compounds as A2A antagonist US Patent  US10822338 Publication Date 11/3/2020 
Target
Name:
Adenosine receptor A2a
Synonyms:
A2A adenosine receptor (hA2A) ADENOSINE A2 ADORA2 Adenosine A2A receptor (A2AAR)
Type:
G Protein-Coupled Receptor (GPCR)
Mol. Mass.:
44716.46
Organism:
Homo sapiens (Human)
Description:
P29274
Residue:
412
  
Inhibitor
Name:
BDBM471649
Synonyms:
US10822338, Example 29C
Type:
Small organic molecule
Emp. Form.:
C18H20F3N5O
Mol. Mass.:
379.3795
SMILES:
Nc1nc2c(O)cccc2c2nc(nn12)[C@@H]1CCC[C@@H](CCC(F)(F)F)C1
: