Target
Adenosine receptor A2a
Ligand
BDBM471671
Substrate
Meas. Tech.
Competition Binding Assay
Ki
5.00±n/a nM
Citation
 Ali, AHuang, XLim, YKuang, RWu, HAnand, RYu, YMetzger, EMan-Chu Lo, MTing, PCStamford, AWTempest, P Substituted aminoquinazoline compounds as A2A antagonist US Patent  US10822338 Publication Date 11/3/2020 
Target
Name:
Adenosine receptor A2a
Synonyms:
A2A adenosine receptor (hA2A) ADENOSINE A2 ADORA2 Adenosine A2A receptor (A2AAR)
Type:
G Protein-Coupled Receptor (GPCR)
Mol. Mass.:
44716.46
Organism:
Homo sapiens (Human)
Description:
P29274
Residue:
412
  
Inhibitor
Name:
BDBM471671
Synonyms:
US10822338, Example 44
Type:
Small organic molecule
Emp. Form.:
C21H28N6O2
Mol. Mass.:
396.486
SMILES:
COc1cccc2c3nc(nn3c(N)nc12)[C@@H]1CCCN(CC2CCOCC2)C1
: