Target
Tyrosine-protein kinase JAK3
Ligand
BDBM305806
Substrate
Meas. Tech.
Caliper Enzyme Assay
IC50
>10000±n/a nM
Citation
 Brown, MFDermenci, AFensome, AGerstenberger, BSHayward, MMOwen, DRWright, SWXing, LHYang, X Pyrazolo[1,5-a]pyrazin-4-yl derivatives US Patent  US10822341 Publication Date 11/3/2020 
Target
Name:
Tyrosine-protein kinase JAK3
Synonyms:
JAK-3 JAK3_HUMAN Janus kinase 3 (JAK3) L-JAK | Leukocyte janus kinase
Type:
Protein
Mol. Mass.:
125111.08
Organism:
Homo sapiens (Human)
Description:
P52333
Residue:
1124
  
Inhibitor
Name:
BDBM305806
Synonyms:
N-(3-(4-(1-((1r,3s)-1-(Cyanomethyl)-3-methoxycyclobutyl)-1H-pyrazol-4-yl)pyrazolo[1,5-a]pyrazin-6-yl)-1H-pyrazol-5-yl)acetamide US10822341, Example 5 | US11472809, Example 5
Type:
Small organic molecule
Emp. Form.:
C21H21N9O2
Mol. Mass.:
431.4505
SMILES:
CO[C@H]1C[C@@](CC#N)(C1)n1cc(cn1)-c1nc(cn2nccc12)-c1cc(NC(C)=O)[nH]n1
: