Target
Tyrosine-protein kinase JAK1
Ligand
BDBM305807
Substrate
Meas. Tech.
Caliper Enzyme Assay
IC50
5720±n/a nM
Citation
 Brown, MFDermenci, AFensome, AGerstenberger, BSHayward, MMOwen, DRWright, SWXing, LHYang, X Pyrazolo[1,5-a]pyrazin-4-yl derivatives US Patent  US10822341 Publication Date 11/3/2020 
Target
Name:
Tyrosine-protein kinase JAK1
Synonyms:
JAK-1 JAK1A JAK1_HUMAN Janus kinase 1 (JAK1) | Janus kinase 1 JAK1
Type:
Protein
Mol. Mass.:
133293.73
Organism:
Homo sapiens (Human)
Description:
P23458
Residue:
1154
  
Inhibitor
Name:
BDBM305807
Synonyms:
5-(4-(1-((1r,3s)-1-(Cyanomethyl)-3-methoxycyclobutyl)-1H-pyrazol-4-yl)pyrazolo[1,5-a]pyrazin-6-yl)-N-methyl-1H-pyrazole-3-carboxamide US10822341, Example 6
Type:
Small organic molecule
Emp. Form.:
C21H21N9O2
Mol. Mass.:
431.4505
SMILES:
CNC(=O)c1cc([nH]n1)-c1cn2nccc2c(n1)-c1cnn(c1)[C@@]1(CC#N)C[C@@H](C1)OC
: