Target
Tyrosine-protein kinase JAK2
Ligand
BDBM305809
Substrate
Meas. Tech.
Caliper Enzyme Assay
IC50
42.0±n/a nM
Citation
 Brown, MFDermenci, AFensome, AGerstenberger, BSHayward, MMOwen, DRWright, SWXing, LHYang, X Pyrazolo[1,5-a]pyrazin-4-yl derivatives US Patent  US10822341 Publication Date 11/3/2020 
Target
Name:
Tyrosine-protein kinase JAK2
Synonyms:
JAK-2 JAK2_HUMAN Janus kinase 2 (JAK2) | Janus kinase 2 (a protein tyrosine kinase)
Type:
Protein
Mol. Mass.:
130684.68
Organism:
Homo sapiens (Human)
Description:
O60674
Residue:
1132
  
Inhibitor
Name:
BDBM305809
Synonyms:
2-(3-(4-(6-(1-Methyl-1H-pyrazol-4-yl)pyrazolo[1,5-a]pyrazin-4-yl)-1H-pyrazol-1-yl)-1-(methylsulfonyl)azetidin-3-yl)acetonitrile US10822341, Example 8 | US11472809, Example 8
Type:
Small organic molecule
Emp. Form.:
C19H19N9O2S
Mol. Mass.:
437.478
SMILES:
Cn1cc(cn1)-c1cn2nccc2c(n1)-c1cnn(c1)C1(CC#N)CN(C1)S(C)(=O)=O
: