Target
Tyrosine-protein kinase JAK1
Ligand
BDBM305810
Substrate
Meas. Tech.
Caliper Enzyme Assay
IC50
185±n/a nM
Citation
 Brown, MFDermenci, AFensome, AGerstenberger, BSHayward, MMOwen, DRWright, SWXing, LHYang, X Pyrazolo[1,5-a]pyrazin-4-yl derivatives US Patent  US10822341 Publication Date 11/3/2020 
Target
Name:
Tyrosine-protein kinase JAK1
Synonyms:
JAK-1 JAK1A JAK1_HUMAN Janus kinase 1 (JAK1) | Janus kinase 1 JAK1
Type:
Protein
Mol. Mass.:
133293.73
Organism:
Homo sapiens (Human)
Description:
P23458
Residue:
1154
  
Inhibitor
Name:
BDBM305810
Synonyms:
2-(1-(Cyclopropylsulfonyl)-3-(4-(6-(1-methyl-1H-pyrazol-4-yl)pyrazolo[1,5-a]pyrazin-4-yl)-1H-pyrazol-1-yl)azetidin-3-yl)acetonitrile US10144738, Example 9 US11472809, Example 9
Type:
Small organic molecule
Emp. Form.:
C21H21N9O2S
Mol. Mass.:
463.516
SMILES:
Cn1cc(cn1)-c1cn2nccc2c(n1)-c1cnn(c1)C1(CC#N)CN(C1)S(=O)(=O)C1CC1
: