Target
Non-receptor tyrosine-protein kinase TYK2
Ligand
BDBM305825
Substrate
Meas. Tech.
Caliper Enzyme Assay
IC50
25.0±n/a nM
Citation
 Brown, MFDermenci, AFensome, AGerstenberger, BSHayward, MMOwen, DRWright, SWXing, LHYang, X Pyrazolo[1,5-a]pyrazin-4-yl derivatives US Patent  US10822341 Publication Date 11/3/2020 
Target
Name:
Non-receptor tyrosine-protein kinase TYK2
Synonyms:
Non-receptor tyrosine-protein kinase TYK2 (TYK2) TYK2_HUMAN | Tyrosine-protein kinase TYK2
Type:
Protein
Mol. Mass.:
133666.03
Organism:
Homo sapiens (Human)
Description:
P29597
Residue:
1187
  
Inhibitor
Name:
BDBM305825
Synonyms:
2-((1r,3s)-1-(4-(6-(5-Amino-1-methyl-1H-pyrazol-3-yl)pyrazolo[1,5-a]pyrazin-4-yl)-1H-pyrazol-1-yl)-3-methoxycyclobutyl)acetonitrile US10822341, Example 24 | US11472809, Example 24
Type:
Small organic molecule
Emp. Form.:
C20H21N9O
Mol. Mass.:
403.4404
SMILES:
CO[C@H]1C[C@@](CC#N)(C1)n1cc(cn1)-c1nc(cn2nccc12)-c1cc(N)n(C)n1
: