Target
Tyrosine-protein kinase JAK3
Ligand
BDBM305827
Substrate
Meas. Tech.
Caliper Enzyme Assay
IC50
>10000±n/a nM
Citation
 Brown, MFDermenci, AFensome, AGerstenberger, BSHayward, MMOwen, DRWright, SWXing, LHYang, X Pyrazolo[1,5-a]pyrazin-4-yl derivatives US Patent  US10822341 Publication Date 11/3/2020 
Target
Name:
Tyrosine-protein kinase JAK3
Synonyms:
JAK-3 JAK3_HUMAN Janus kinase 3 (JAK3) L-JAK | Leukocyte janus kinase
Type:
Protein
Mol. Mass.:
125111.08
Organism:
Homo sapiens (Human)
Description:
P52333
Residue:
1124
  
Inhibitor
Name:
BDBM305827
Synonyms:
(1r,3r)-3-(Cyanomethyl)-3-(4-(6-(5-methyl-1H-pyrazol-3-yl)pyrazolo[1,5-a]pyrazin-4-yl)-1H-pyrazol-1-yl)cyclobutane-1-carbonitrile US10822341, Example 26 | US11472809, Example 26
Type:
Small organic molecule
Emp. Form.:
C20H17N9
Mol. Mass.:
383.4093
SMILES:
Cc1cc(n[nH]1)-c1cn2nccc2c(n1)-c1cnn(c1)[C@@]1(CC#N)C[C@@H](C1)C#N
: