Target
NADPH oxidase 1
Ligand
BDBM300376
Substrate
Meas. Tech.
ROS Production Measurement on hNOX1 Membranes
Ki
66.0±n/a nM
Citation
 Machin, PSharpe, ALock, CJChambers, MSHodges, AAllen, VEllard, JM Amido thiadiazole derivatives as NADPH oxidase inhibitors US Patent  US10130619 Publication Date 11/20/2018 
Target
Name:
NADPH oxidase 1
Synonyms:
MOX-1 Mitogenic oxidase 1 NOH-1 NOX-1 NOX1_HUMAN
Type:
PROTEIN
Mol. Mass.:
64890.44
Organism:
Homo sapiens (Human)
Description:
ChEMBL_792877
Residue:
564
  
Inhibitor
Name:
BDBM300376
Synonyms:
US10130619, Example 66
Type:
Small organic molecule
Emp. Form.:
C26H24N8O2S
Mol. Mass.:
512.586
SMILES:
C[C@H](Oc1ncc(cc1NCc1cn(C)cn1)C(=O)Nc1nnc(s1)-c1ccncc1)c1ccccc1
: