Target
NADPH oxidase 1
Ligand
BDBM300421
Substrate
Meas. Tech.
ROS Production Measurement on hNOX1 Membranes
Ki
55.0±n/a nM
Citation
 Machin, PSharpe, ALock, CJChambers, MSHodges, AAllen, VEllard, JM Amido thiadiazole derivatives as NADPH oxidase inhibitors US Patent  US10130619 Publication Date 11/20/2018 
Target
Name:
NADPH oxidase 1
Synonyms:
MOX-1 Mitogenic oxidase 1 NOH-1 NOX-1 NOX1_HUMAN
Type:
PROTEIN
Mol. Mass.:
64890.44
Organism:
Homo sapiens (Human)
Description:
ChEMBL_792877
Residue:
564
  
Inhibitor
Name:
BDBM300421
Synonyms:
US10130619, Example 187
Type:
Small organic molecule
Emp. Form.:
C25H22F2N6O2S
Mol. Mass.:
508.543
SMILES:
FC1(F)CCN(C[C@H](Oc2ccc(cn2)C(=O)Nc2nnc(s2)-c2ccncc2)c2ccccc2)C1
: