Target
Mitogen-activated protein kinase kinase kinase 14
Ligand
BDBM471696
Substrate
Meas. Tech.
AlphaScreen Assay
IC50
65.0±n/a nM
Citation
 Hynd, GTisselli, PMacLeod, CMann, SEPanchal, TAMontana, JGPrice, SC Pyrazolopyrimidine derivatives as NIK inhibitors US Patent  US10822342 Publication Date 11/3/2020 
Target
Name:
Mitogen-activated protein kinase kinase kinase 14
Synonyms:
HsNIK MAP3K14 NF-kappa-beta-inducing kinase (NF-kB) Serine/threonine-protein kinase NIK
Type:
Protein
Mol. Mass.:
104059.50
Organism:
Homo sapiens (Human)
Description:
Q99558
Residue:
947
  
Inhibitor
Name:
BDBM471696
Synonyms:
US10822342, Compound 4
Type:
Small organic molecule
Emp. Form.:
C24H27FN6O2
Mol. Mass.:
450.5086
SMILES:
CCn1cc2nc(N)nc(-c3cn(CCCOC)c4cc(F)c(cc34)C#CC(C)(C)O)c2n1
: