Target
Potassium voltage-gated channel subfamily A member 3
Ligand
BDBM412891
Substrate
Meas. Tech.
Patch-Clamp Assay
IC50
<500±n/a nM
Citation
 Tasler, SKrimmelbein, IKraus, JZaja, M KV1.3 inhibitors and their medical application US Patent  US10822345 Publication Date 11/3/2020 
Target
Name:
Potassium voltage-gated channel subfamily A member 3
Synonyms:
HGK5 HPCN3 KCNA3 Potassium voltage-gated channel subfamily A member 3 Voltage-gated potassium channel subunit Kv1.3
Type:
PROTEIN
Mol. Mass.:
63835.47
Organism:
Homo sapiens (Human)
Description:
ChEMBL_1513935
Residue:
575
  
Inhibitor
Name:
BDBM412891
Synonyms:
US10399991, Example 8 | US10822345, Ex 8
Type:
Small organic molecule
Emp. Form.:
C19H13FO3
Mol. Mass.:
308.3031
SMILES:
Cc1coc2c(C)c3oc(=O)cc(-c4ccccc4F)c3cc12
: