Target
Potassium voltage-gated channel subfamily A member 3
Ligand
BDBM412899
Substrate
Meas. Tech.
Patch-Clamp Assay
IC50
<500±n/a nM
Citation
 Tasler, SKrimmelbein, IKraus, JZaja, M KV1.3 inhibitors and their medical application US Patent  US10822345 Publication Date 11/3/2020 
Target
Name:
Potassium voltage-gated channel subfamily A member 3
Synonyms:
HGK5 HPCN3 KCNA3 Potassium voltage-gated channel subfamily A member 3 Voltage-gated potassium channel subunit Kv1.3
Type:
PROTEIN
Mol. Mass.:
63835.47
Organism:
Homo sapiens (Human)
Description:
ChEMBL_1513935
Residue:
575
  
Inhibitor
Name:
BDBM412899
Synonyms:
US10399991, Example 16 | US10822345, Ex 16
Type:
Small organic molecule
Emp. Form.:
C21H18O3
Mol. Mass.:
318.3658
SMILES:
CCc1coc2c(C)c3oc(=O)c(C)c(-c4ccccc4)c3cc12
: