Target
Potassium voltage-gated channel subfamily A member 3
Ligand
BDBM412910
Substrate
Meas. Tech.
Patch-Clamp Assay
IC50
1000±n/a nM
Citation
 Tasler, SKrimmelbein, IKraus, JZaja, M KV1.3 inhibitors and their medical application US Patent  US10822345 Publication Date 11/3/2020 
Target
Name:
Potassium voltage-gated channel subfamily A member 3
Synonyms:
HGK5 HPCN3 KCNA3 Potassium voltage-gated channel subfamily A member 3 Voltage-gated potassium channel subunit Kv1.3
Type:
PROTEIN
Mol. Mass.:
63835.47
Organism:
Homo sapiens (Human)
Description:
ChEMBL_1513935
Residue:
575
  
Inhibitor
Name:
BDBM412910
Synonyms:
US10399991, Example 27 | US10822345, Ex 27
Type:
Small organic molecule
Emp. Form.:
C19H13BrFNO2
Mol. Mass.:
386.214
SMILES:
Cc1coc2c(C)c3[nH]c(=O)c(Br)c(-c4ccccc4F)c3cc12
: