Target
Potassium voltage-gated channel subfamily A member 3
Ligand
BDBM412912
Substrate
Meas. Tech.
Patch-Clamp Assay
IC50
2250±n/a nM
Citation
 Tasler, SKrimmelbein, IKraus, JZaja, M KV1.3 inhibitors and their medical application US Patent  US10822345 Publication Date 11/3/2020 
Target
Name:
Potassium voltage-gated channel subfamily A member 3
Synonyms:
HGK5 HPCN3 KCNA3 Potassium voltage-gated channel subfamily A member 3 Voltage-gated potassium channel subunit Kv1.3
Type:
PROTEIN
Mol. Mass.:
63835.47
Organism:
Homo sapiens (Human)
Description:
ChEMBL_1513935
Residue:
575
  
Inhibitor
Name:
BDBM412912
Synonyms:
US10399991, Example 29 | US10822345, Ex 29
Type:
Small organic molecule
Emp. Form.:
C20H17NO2
Mol. Mass.:
303.3545
SMILES:
Cc1coc2c(C)c3[nH]c(=O)cc(-c4ccccc4C)c3cc12
: