Target
Potassium voltage-gated channel subfamily A member 3
Ligand
BDBM412942
Substrate
Meas. Tech.
Patch-Clamp Assay
IC50
1000±n/a nM
Citation
 Tasler, SKrimmelbein, IKraus, JZaja, M KV1.3 inhibitors and their medical application US Patent  US10822345 Publication Date 11/3/2020 
Target
Name:
Potassium voltage-gated channel subfamily A member 3
Synonyms:
HGK5 HPCN3 KCNA3 Potassium voltage-gated channel subfamily A member 3 Voltage-gated potassium channel subunit Kv1.3
Type:
PROTEIN
Mol. Mass.:
63835.47
Organism:
Homo sapiens (Human)
Description:
ChEMBL_1513935
Residue:
575
  
Inhibitor
Name:
BDBM412942
Synonyms:
US10399991, Example 59 | US10822345, Ex 59
Type:
Small organic molecule
Emp. Form.:
C22H21NO2
Mol. Mass.:
331.4076
SMILES:
Cc1coc2c(C)c3n(C)c(=O)c(C)c(-c4ccccc4C)c3cc12
: