Target
Potassium voltage-gated channel subfamily A member 3
Ligand
BDBM412943
Substrate
Meas. Tech.
Patch-Clamp Assay
IC50
<500±n/a nM
Citation
 Tasler, SKrimmelbein, IKraus, JZaja, M KV1.3 inhibitors and their medical application US Patent  US10822345 Publication Date 11/3/2020 
Target
Name:
Potassium voltage-gated channel subfamily A member 3
Synonyms:
HGK5 HPCN3 KCNA3 Potassium voltage-gated channel subfamily A member 3 Voltage-gated potassium channel subunit Kv1.3
Type:
PROTEIN
Mol. Mass.:
63835.47
Organism:
Homo sapiens (Human)
Description:
ChEMBL_1513935
Residue:
575
  
Inhibitor
Name:
BDBM412943
Synonyms:
US10399991, Example 60 | US10822345, Ex 60
Type:
Small organic molecule
Emp. Form.:
C21H18ClNO2
Mol. Mass.:
351.826
SMILES:
Cc1coc2c(C)c3n(C)c(=O)c(C)c(-c4ccccc4Cl)c3cc12
: