Target
Complement factor D
Ligand
BDBM354270
Substrate
Meas. Tech.
Inhibition Assay
IC50
<1000±n/a nM
Citation
 Wiles, JAPhadke, ASDeshpande, MAgarwal, AChen, DGadhachanda, VRHashimoto, APais, GWang, QWang, X Aryl, heteroaryl, and heterocyclic compounds for treatment of medical disorders US Patent  US10822352 Publication Date 11/3/2020 
Target
Name:
Complement factor D
Synonyms:
Adipsin CFAD_HUMAN DF Properdin factor D
Type:
Protein
Mol. Mass.:
27039.19
Organism:
Homo sapiens (Human)
Description:
P00746
Residue:
253
  
Inhibitor
Name:
BDBM354270
Synonyms:
(2S,4R)-1-(2-(3-acetyl- 5-(2-hydroxypyrimidin- 5-yl)-1H-indol-1- yl)acetyl)-N-(2'-chloro- 2-fluorobiphenyl-3-yl)- 4-fluoropyrrolidine-2- carboxamide US10822352, Comp No. 186 | US9796741, cmp No. 186
Type:
Small organic molecule
Emp. Form.:
C33H26ClF2N5O4
Mol. Mass.:
630.04
SMILES:
CC(=O)c1cn(CC(=O)N2C[C@H](F)C[C@H]2C(=O)Nc2cccc(c2F)-c2ccccc2Cl)c2ccc(cc12)-c1cnc(O)nc1
: