Target
Complement factor D
Ligand
BDBM472025
Substrate
Meas. Tech.
Inhibition Assay
IC50
<1000±n/a nM
Citation
 Wiles, JAPhadke, ASDeshpande, MAgarwal, AChen, DGadhachanda, VRHashimoto, APais, GWang, QWang, X Aryl, heteroaryl, and heterocyclic compounds for treatment of medical disorders US Patent  US10822352 Publication Date 11/3/2020 
Target
Name:
Complement factor D
Synonyms:
Adipsin CFAD_HUMAN DF Properdin factor D
Type:
Protein
Mol. Mass.:
27039.19
Organism:
Homo sapiens (Human)
Description:
P00746
Residue:
253
  
Inhibitor
Name:
BDBM472025
Synonyms:
(2S,4R)-1-(2-(3- acetyl-5- (imidazo[1,2- b]pyridazin-7-yl)- 1H-indazol-1- yl)acetyl)-N-(6- bromopyridin-2- yl)-4- fluoropyrrolidine-2- carboxamide | US10822352, Comp No. 304
Type:
Small organic molecule
Emp. Form.:
C27H23BrFN8O3
Mol. Mass.:
606.426
SMILES:
CC(=O)c1nn(CC(=O)N2C[C@H](F)C[C@H]2C(=O)Nc2cccc(Br)n2)c2ccc(cc12)C1=CC2N=CC=[N]2N=C1
: