Target
Complement factor D
Ligand
BDBM386641
Substrate
Meas. Tech.
Inhibition Assay
IC50
<1000±n/a nM
Citation
 Wiles, JAPhadke, ASDeshpande, MAgarwal, AChen, DGadhachanda, VRHashimoto, APais, GWang, QWang, X Aryl, heteroaryl, and heterocyclic compounds for treatment of medical disorders US Patent  US10822352 Publication Date 11/3/2020 
Target
Name:
Complement factor D
Synonyms:
Adipsin CFAD_HUMAN DF Properdin factor D
Type:
Protein
Mol. Mass.:
27039.19
Organism:
Homo sapiens (Human)
Description:
P00746
Residue:
253
  
Inhibitor
Name:
BDBM386641
Synonyms:
(S)-1-(2-(3- acetyl-5- (quinolin-7-yl)- 1H-indazol-1- yl)acetyl)-N-(6- methylpyridin-2- yl)pyrrolidine-2- carboxamide US10822352, Comp No. 589
Type:
Small organic molecule
Emp. Form.:
C31H28N6O3
Mol. Mass.:
532.5924
SMILES:
CC(=O)c1nn(CC(=O)N2CCC[C@H]2C(=O)Nc2cccc(C)n2)c2ccc(cc12)-c1ccc2cccnc2c1
: