Target
Serine/threonine-protein kinase pim-3
Ligand
BDBM377160
Substrate
Meas. Tech.
Pim Enzyme Assay
IC50
<100±n/a nM
Citation
 Xue, CLi, YFeng, HZhang, K Thiazolecarboxamides and pyridinecarboxamide compounds useful as pim kinase inhibitors US Patent  US10828290 Publication Date 11/10/2020 
Target
Name:
Serine/threonine-protein kinase pim-3
Synonyms:
PIM3 Serine/threonine-protein kinase pim-3 (PIM3)
Type:
Protein
Mol. Mass.:
35888.19
Organism:
Homo sapiens (Human)
Description:
Q86V86
Residue:
326
  
Inhibitor
Name:
BDBM377160
Synonyms:
N-{4-[(3S)-3-Aminopiperidin-1-yl]-7-hydroxy-6,7-dihydro-5H-cyclopenta[b]pyridin-3-yl}-2-(2,6-difluorophenyl)-1,3-thiazole-4-carboxamide US10517858, Example 16 (Diastereoisomer 1) | US10828290, Example 16 (Diastereoisomer 1)
Type:
Small organic molecule
Emp. Form.:
C23H23F2N5O2S
Mol. Mass.:
471.523
SMILES:
N[C@H]1CCCN(C1)c1c2CC[C@H](O)c2ncc1NC(=O)c1csc(n1)-c1c(F)cccc1F
: