Target
Serine/threonine-protein kinase pim-1
Ligand
BDBM377175
Substrate
Meas. Tech.
Pim Enzyme Assay
IC50
<100±n/a nM
Citation
 Xue, CLi, YFeng, HZhang, K Thiazolecarboxamides and pyridinecarboxamide compounds useful as pim kinase inhibitors US Patent  US10828290 Publication Date 11/10/2020 
Target
Name:
Serine/threonine-protein kinase pim-1
Synonyms:
PIM-1 Kinase PIM1_HUMAN Serine/threonine-protein kinase (PIM1) Serine/threonine-protein kinase PIM1 | Serine/threonine-protein kinase pim-1 (PIM1)
Type:
Protein
Mol. Mass.:
35681.82
Organism:
Homo sapiens (Human)
Description:
P11309
Residue:
313
  
Inhibitor
Name:
BDBM377175
Synonyms:
5-Amino-N-{4-[(3,4-cis-3-amino-4-hydroxypiperidin-1-yl]-6,7-dihydro-5H-cyclopenta[b]pyridin-3-yl}-2-(2,6-difluorophenyl)-1,3-thiazole-4-carboxamide (Enantiomer 1) US10517858, Example 26 US11229631, Example 26
Type:
Small organic molecule
Emp. Form.:
C23H24F2N6O2S
Mol. Mass.:
486.537
SMILES:
N[C@H]1CN(CC[C@H]1O)c1c2CCCc2ncc1NC(=O)c1nc(sc1N)-c1c(F)cccc1F
: