Target
Serine/threonine-protein kinase pim-2
Ligand
BDBM377182
Substrate
Meas. Tech.
Pim Enzyme Assay
IC50
<100±n/a nM
Citation
 Xue, CLi, YFeng, HZhang, K Thiazolecarboxamides and pyridinecarboxamide compounds useful as pim kinase inhibitors US Patent  US10828290 Publication Date 11/10/2020 
Target
Name:
Serine/threonine-protein kinase pim-2
Synonyms:
PIM2 Pim-2h Serine/threonine-protein kinase PIM | Serine/threonine-protein kinase pim-2 (PIM2)
Type:
Serine/threonine-protein kinase
Mol. Mass.:
34185.93
Organism:
Homo sapiens (Human)
Description:
Q9P1W9
Residue:
311
  
Inhibitor
Name:
BDBM377182
Synonyms:
3-Amino-N-{4-[(3S)-3-aminopiperidin-1-yl]-5,6,7,8-tetrahydro-1,8-naphthyridin-3-yl}-6-(2,6-difluorophenyl)-5-fluoropyridine-2-carboxamide US10517858, Example 32 US11229631, Example 32
Type:
Small organic molecule
Emp. Form.:
C25H26F3N7O
Mol. Mass.:
497.5154
SMILES:
N[C@H]1CCCN(C1)c1c(NC(=O)c2nc(c(F)cc2N)-c2c(F)cccc2F)cnc2NCCCc12
: