Target
Serine/threonine-protein kinase pim-3
Ligand
BDBM377184
Substrate
Meas. Tech.
Pim Enzyme Assay
IC50
<100±n/a nM
Citation
 Xue, CLi, YFeng, HZhang, K Thiazolecarboxamides and pyridinecarboxamide compounds useful as pim kinase inhibitors US Patent  US10828290 Publication Date 11/10/2020 
Target
Name:
Serine/threonine-protein kinase pim-3
Synonyms:
PIM3 Serine/threonine-protein kinase pim-3 (PIM3)
Type:
Protein
Mol. Mass.:
35888.19
Organism:
Homo sapiens (Human)
Description:
Q86V86
Residue:
326
  
Inhibitor
Name:
BDBM377184
Synonyms:
5-Amino-N-{4-[(3S)-3-aminopiperidin-1-yl]-1H-pyrazolo[3,4-b]pyridin-5-yl}-2-(2,6-difluorophenyl)-1,3-thiazole-4-carboxamide US10517858, Example 34 US11229631, Example 34
Type:
Small organic molecule
Emp. Form.:
C21H20F2N8OS
Mol. Mass.:
470.498
SMILES:
N[C@H]1CCCN(C1)c1c(NC(=O)c2nc(sc2N)-c2c(F)cccc2F)cnc2[nH]ncc12
: