Target
Serine/threonine-protein kinase pim-1
Ligand
BDBM377230
Substrate
Meas. Tech.
Pim Enzyme Assay
IC50
<100±n/a nM
Citation
 Xue, CLi, YFeng, HZhang, K Thiazolecarboxamides and pyridinecarboxamide compounds useful as pim kinase inhibitors US Patent  US10828290 Publication Date 11/10/2020 
Target
Name:
Serine/threonine-protein kinase pim-1
Synonyms:
PIM-1 Kinase PIM1_HUMAN Serine/threonine-protein kinase (PIM1) Serine/threonine-protein kinase PIM1 | Serine/threonine-protein kinase pim-1 (PIM1)
Type:
Protein
Mol. Mass.:
35681.82
Organism:
Homo sapiens (Human)
Description:
P11309
Residue:
313
  
Inhibitor
Name:
BDBM377230
Synonyms:
N-{4-[(3R,5S)-3-Amino-4-hydroxy-4,5-dimethylpiperidin-1-yl]-7-hydroxy-6,7-dihydro-5H-cyclopenta[b]pyridin-3-yl}-6-(2,6-difluorophenyl)-5-fluoropyridine-2-carboxamide US10828290, Example 63 (Diastereoisomer 1)
Type:
Small organic molecule
Emp. Form.:
C27H28F3N5O3
Mol. Mass.:
527.5381
SMILES:
C[C@H]1CN(C[C@@H](N)C1(C)O)c1c2CC[C@H](O)c2ncc1NC(=O)c1ccc(F)c(n1)-c1c(F)cccc1F
: