Target
Tyrosine-protein kinase SYK
Ligand
BDBM212273
Substrate
Meas. Tech.
High Throughput Biochemical Assay
IC50
44.0±n/a nM
Citation
 Blomgren, PACurrie, KSKropf, JELee, SHLo, JRMitchell, SASchmitt, ACSwaminathan, SXiong, JXu, JZhao, Z Crystalline monomesylate salt of 6-(6-aminopyrazin-2-yl)-n-(4-(4-(oxetan-3-yl)piperazin-1-yl)phenyl)imidazo[1,2-a]pyrazin-8-amine US Patent  US10828299 Publication Date 11/10/2020 
Target
Name:
Tyrosine-protein kinase SYK
Synonyms:
KSYK_HUMAN Spleen Tyrosine Kinase Tyrosine-protein kinase SYK (Syk)
Type:
Enzyme
Mol. Mass.:
72079.99
Organism:
Homo sapiens (Human)
Description:
P43405
Residue:
635
  
Inhibitor
Name:
BDBM212273
Synonyms:
6-(6-aminopyrazin-2-yl)-5-methyl-N-(4-(4-(oxetan-3-yl)piperazin-1-yl)phenyl)imidazo[1,2-a]pyrazin-8-amine US10828299, Example Ex.-4 US9290505, Ex.-4 US9931338, Ex.-4
Type:
Small organic molecule
Emp. Form.:
C24H27N9O
Mol. Mass.:
457.5309
SMILES:
Cc1c(nc(Nc2ccc(cc2)N2CCN(CC2)C2COC2)c2nccn12)-c1cncc(N)n1
: