Target
Tyrosine-protein kinase BTK
Ligand
BDBM397150
Substrate
Meas. Tech.
Omnia Assay Protocol for Potency Assessment Against BTK
IC50
<10±n/a nM
Citation
 Singh, JPetter, RCTester, RWKluge, AFMazdiyasni, HWestlin, III, WFNiu, DQiao, L Substituted 2,4-diaminopyrimidines as kinase inhibitors US Patent  US10828300 Publication Date 11/10/2020 
Target
Name:
Tyrosine-protein kinase BTK
Synonyms:
AGMX1 Agammaglobulinaemia tyrosine kinase B cell progenitor kinase BPK BTK_HUMAN Tyrosine Kinase BTK Tyrosine-protein kinase BTK (BTK)
Type:
Enzyme
Mol. Mass.:
76289.95
Organism:
Homo sapiens (Human)
Description:
Q06187
Residue:
659
  
Inhibitor
Name:
BDBM397150
Synonyms:
US10596172, Compound I-38 US11351168, Compound I-38 | US9987276, Compound I-38
Type:
Small organic molecule
Emp. Form.:
C23H26N6O
Mol. Mass.:
402.4921
SMILES:
CN(C)C\C=C\C(=O)Nc1cccc(Nc2nc(Nc3ccccc3)ncc2C)c1
: