Target
Tyrosine-protein kinase SYK
Ligand
BDBM255493
Substrate
Meas. Tech.
Biochemical Assay
IC50
685±n/a nM
Citation
 Singh, RArgade, APayan, DGMolineaux, SHolland, SJClough, JKeim, HBhamidipati, SSylvain, CLi, HRossi, AB 2,4-pyrimidinediamine compounds and their uses US Patent  US10828301 Publication Date 11/10/2020 
Target
Name:
Tyrosine-protein kinase SYK
Synonyms:
KSYK_HUMAN Spleen Tyrosine Kinase Tyrosine-protein kinase SYK (Syk)
Type:
Enzyme
Mol. Mass.:
72079.99
Organism:
Homo sapiens (Human)
Description:
P43405
Residue:
635
  
Inhibitor
Name:
BDBM255493
Synonyms:
US10828301, Compound R940269 | US9499493, R940269
Type:
Small organic molecule
Emp. Form.:
C23H25ClFN5O3
Mol. Mass.:
473.928
SMILES:
Cc1cc(Nc2nc(Nc3cccc(OCCN4CCOCC4)c3)ncc2F)cc(Cl)c1O
: