Target
Tyrosine-protein kinase SYK
Ligand
BDBM255504
Substrate
Meas. Tech.
Biochemical Assay
IC50
292±n/a nM
Citation
 Singh, RArgade, APayan, DGMolineaux, SHolland, SJClough, JKeim, HBhamidipati, SSylvain, CLi, HRossi, AB 2,4-pyrimidinediamine compounds and their uses US Patent  US10828301 Publication Date 11/10/2020 
Target
Name:
Tyrosine-protein kinase SYK
Synonyms:
KSYK_HUMAN Spleen Tyrosine Kinase Tyrosine-protein kinase SYK (Syk)
Type:
Enzyme
Mol. Mass.:
72079.99
Organism:
Homo sapiens (Human)
Description:
P43405
Residue:
635
  
Inhibitor
Name:
BDBM255504
Synonyms:
US10828301, Compound R926834 | US9499493, R926834
Type:
Small organic molecule
Emp. Form.:
C20H20FN5O4
Mol. Mass.:
413.4023
SMILES:
CNC(=O)COc1cccc(Nc2ncc(F)c(Nc3ccc(OC)c(O)c3)n2)c1
: