Target
Tyrosine-protein kinase SYK
Ligand
BDBM471752
Substrate
Meas. Tech.
Biochemical Assay
IC50
255±n/a nM
Citation
 Singh, RArgade, APayan, DGMolineaux, SHolland, SJClough, JKeim, HBhamidipati, SSylvain, CLi, HRossi, AB 2,4-pyrimidinediamine compounds and their uses US Patent  US10828301 Publication Date 11/10/2020 
Target
Name:
Tyrosine-protein kinase SYK
Synonyms:
KSYK_HUMAN Spleen Tyrosine Kinase Tyrosine-protein kinase SYK (Syk)
Type:
Enzyme
Mol. Mass.:
72079.99
Organism:
Homo sapiens (Human)
Description:
P43405
Residue:
635
  
Inhibitor
Name:
BDBM471752
Synonyms:
5-Fluoro-N4-[(1H)-indol-5-yl]-N2-[3-[(N-methylamino) carbonylmethyleneoxy]phenyl]-2,4-pyrimidinediamine | US10828301, Compound R926931
Type:
Small organic molecule
Emp. Form.:
C21H19FN6O2
Mol. Mass.:
406.413
SMILES:
CNC(=O)COc1cccc(Nc2ncc(F)c(Nc3ccc4[nH]ccc4c3)n2)c1
: