Target
Tyrosine-protein kinase SYK
Ligand
BDBM471765
Substrate
Meas. Tech.
Biochemical Assay
IC50
62.0±n/a nM
Citation
 Singh, RArgade, APayan, DGMolineaux, SHolland, SJClough, JKeim, HBhamidipati, SSylvain, CLi, HRossi, AB 2,4-pyrimidinediamine compounds and their uses US Patent  US10828301 Publication Date 11/10/2020 
Target
Name:
Tyrosine-protein kinase SYK
Synonyms:
KSYK_HUMAN Spleen Tyrosine Kinase Tyrosine-protein kinase SYK (Syk)
Type:
Enzyme
Mol. Mass.:
72079.99
Organism:
Homo sapiens (Human)
Description:
P43405
Residue:
635
  
Inhibitor
Name:
BDBM471765
Synonyms:
N4-[(2,2-Dimethyl-4H-benzo[1,4]oxazin-3-one)-6-yl]-5-fluoro-N2-[3-(methylaminocarbonylmethyleneoxy)phenyl]-2,4-pyrimidinediamine | US10828301, Compound R940323
Type:
Small organic molecule
Emp. Form.:
C23H23FN6O4
Mol. Mass.:
466.4649
SMILES:
CNC(=O)COc1cccc(Nc2ncc(F)c(Nc3ccc4OC(C)(C)C(=O)Nc4c3)n2)c1
: